Target
Stromelysin-1
Ligand
BDBM50213416
Substrate
Meas. Tech.
ChEMBL_447906 (CHEMBL898156)
IC50
21000±n/a nM
Citation
 Moroy, GDenhez, CEl Mourabit, HToribio, ADassonville, ADecarme, MRenault, JHMirand, CBellon, GSapi, JAlix, AJHornebeck, WBourguet, E Simultaneous presence of unsaturation and long alkyl chain at P'1 of Ilomastat confers selectivity for gelatinase A (MMP-2) over gelatinase B (MMP-9) inhibition as shown by molecular modelling studies. Bioorg Med Chem 15:4753-66 (2007)  
Target
Name:
Stromelysin-1
Synonyms:
MMP-3 MMP3_HUMAN Matrix metalloproteinase 3 Matrix metalloproteinase-3 (MMP-3) SL-1 Stromelysin 1 | Transin-1
Type:
Enzyme
Mol. Mass.:
53973.13
Organism:
Homo sapiens (Human)
Description:
P08254
Residue:
477
  
Inhibitor
Name:
BDBM50213416
Synonyms:
(2E)-3-(N-hydroxycarbamoyl)-2-[(2E)-3-phenylprop-2-en-1-ylidene]propionyl-L-tryptophan-N-methylamide | CHEMBL391509
Type:
Small organic molecule
Emp. Form.:
C25H26N4O4
Mol. Mass.:
446.4983
SMILES:
CNC(=O)[C@H](Cc1c[nH]c2ccccc12)NC(=O)C(CC(=O)NO)=CC=Cc1ccccc1
: