Target
Beta-3 adrenergic receptor
Ligand
BDBM50218165
Substrate
Meas. Tech.
ChEMBL_457035 (CHEMBL924399)
EC50
26±n/a nM
Citation
 Lafontaine, JADay, RFDibrino, JHadcock, JRHargrove, DMLinhares, MMartin, KAMaurer, TSNardone, NATess, DADasilva-Jardine, P Discovery of potent and orally bioavailable heterocycle-based beta3-adrenergic receptor agonists, potential therapeutics for the treatment of obesity. Bioorg Med Chem Lett 17:5245-50 (2007)  
Target
Name:
Beta-3 adrenergic receptor
Synonyms:
ADRB3_RAT Adrb3r Beta-3 adrenergic receptor
Type:
PROTEIN
Mol. Mass.:
43161.83
Organism:
Rattus norvegicus
Description:
ChEMBL_1509452
Residue:
400
  
Inhibitor
Name:
BDBM50218165
Synonyms:
(R)-1-(pyridin-3-yl)-2-(2-(4-(thiazol-4-yl)phenoxy)ethylamino)ethanol | CHEMBL251392
Type:
Small organic molecule
Emp. Form.:
C18H19N3O2S
Mol. Mass.:
341.427
SMILES:
O[C@@H](CNCCOc1ccc(cc1)-c1cscn1)c1cccnc1
: