Target
D(3) dopamine receptor
Ligand
BDBM50219108
Substrate
Meas. Tech.
ChEMBL_445362 (CHEMBL895652)
IC50
1.2±n/a nM
Citation
 Grundt, PPrevatt, KMCao, JTaylor, MFloresca, CZChoi, JKJenkins, BGLuedtke, RRNewman, AH Heterocyclic analogues of N-(4-(4-(2,3-dichlorophenyl)piperazin-1-yl)butyl)arylcarboxamides with functionalized linking chains as novel dopamine D3 receptor ligands: potential substance abuse therapeutic agents. J Med Chem 50:4135-46 (2007)  
Target
Name:
D(3) dopamine receptor
Synonyms:
DOPAMINE D3 DRD3_HUMAN Dopamine D3 receptor (D3) Dopamine receptor Dopamine receptor D3
Type:
Mol. Mass.:
44243.43
Organism:
Homo sapiens (Human)
Description:
Residue:
400
  
Inhibitor
Name:
BDBM50219108
Synonyms:
CHEMBL244774 | N-(4-(4-(2,3-dichlorophenyl)piperazin-1-yl)-trans-but-2-enyl)-4-(pyridin-N-oxide-2-yl)benzamide
Type:
Small organic molecule
Emp. Form.:
C26H26Cl2N4O2
Mol. Mass.:
497.416
SMILES:
[O-][n+]1ccccc1-c1ccc(cc1)C(=O)NC\C=C\CN1CCN(CC1)c1cccc(Cl)c1Cl
: