Target
D(3) dopamine receptor
Ligand
BDBM50219117
Substrate
Meas. Tech.
ChEMBL_445362 (CHEMBL895652)
IC50
1±n/a nM
Citation
 Grundt, PPrevatt, KMCao, JTaylor, MFloresca, CZChoi, JKJenkins, BGLuedtke, RRNewman, AH Heterocyclic analogues of N-(4-(4-(2,3-dichlorophenyl)piperazin-1-yl)butyl)arylcarboxamides with functionalized linking chains as novel dopamine D3 receptor ligands: potential substance abuse therapeutic agents. J Med Chem 50:4135-46 (2007)  
Target
Name:
D(3) dopamine receptor
Synonyms:
DOPAMINE D3 DRD3_HUMAN Dopamine D3 receptor (D3) Dopamine receptor Dopamine receptor D3
Type:
Mol. Mass.:
44243.43
Organism:
Homo sapiens (Human)
Description:
Residue:
400
  
Inhibitor
Name:
BDBM50219117
Synonyms:
CHEMBL244562 US8748608, 9
Type:
Small organic molecule
Emp. Form.:
C26H26Cl2N4O2
Mol. Mass.:
497.416
SMILES:
Clc1cccc(N2CCN(C\C=C\CNC(=O)c3ccc(cc3)-c3cccc(=O)[nH]3)CC2)c1Cl
: