Target
Androgen receptor
Ligand
BDBM50219260
Substrate
Meas. Tech.
ChEMBL_448903 (CHEMBL898054)
EC50
>10000±n/a nM
Citation
 Zhang, PTerefenko, EKern, JFensome, ATrybulski, EUnwalla, RWrobel, JLockhead, SZhu, YCohen, JLacava, MWinneker, RCZhang, Z 5-(3-Cyclopentyl-2-thioxo-2,3-dihydro-1H-benzimidazol-5-yl)-1-methyl-1H-pyrrole-2-carbonitrile: A novel, highly potent, selective, and orally active non-steroidal progesterone receptor agonist. Bioorg Med Chem 15:6556-64 (2007)  
Target
Name:
Androgen receptor
Synonyms:
ANDR_HUMAN Androgen Receptor Androgen receptor/Baculoviral IAP repeat-containing protein 2 Dihydrotestosterone receptor Nuclear receptor subfamily 3 group C member 4
Type:
Receptor
Mol. Mass.:
99185.27
Organism:
Homo sapiens (Human)
Description:
CHO cells were stably transfected with human AR gene.
Residue:
920
  
Inhibitor
Name:
BDBM50219260
Synonyms:
5-(3-cyclopentyl-2-thioxo-2,3-dihydro-1H-benzimidazol-5-yl)-1-methyl-1H-pyrrole-2-carbonitrile | CHEMBL239957
Type:
Small organic molecule
Emp. Form.:
C18H18N4S
Mol. Mass.:
322.427
SMILES:
Cn1c(ccc1-c1ccc2[nH]c(=S)n(C3CCCC3)c2c1)C#N
: