Target
Dipeptidyl peptidase 8
Ligand
BDBM50225425
Substrate
Meas. Tech.
ChEMBL_451390 (CHEMBL901593)
Kd
770±n/a nM
Citation
 Van der Veken, PSoroka, ABrandt, IChen, YSMaes, MBLambeir, AMChen, XHaemers, AScharpé, SAugustyns, KDe Meester, I Irreversible inhibition of dipeptidyl peptidase 8 by dipeptide-derived diaryl phosphonates. J Med Chem 50:5568-70 (2007)  
Target
Name:
Dipeptidyl peptidase 8
Synonyms:
DPP8 DPRP-1 Dipeptidyl peptidase 8 (DPP-8) Dipeptidyl peptidase 8/9 Dipeptidyl peptidase VIII Prolyl dipeptidase DPP8
Type:
Enzyme
Mol. Mass.:
103342.62
Organism:
Homo sapiens (Human)
Description:
Q6V1X1
Residue:
898
  
Inhibitor
Name:
BDBM50225425
Synonyms:
CHEMBL440982 | di-(4-acetamido)phenyl 2-((S)-2,6-diaminohexanoyl)isoindolin-1-ylphosphonate
Type:
Small organic molecule
Emp. Form.:
C30H36N5O6P
Mol. Mass.:
593.6105
SMILES:
CC(=O)Nc1ccc(OP(=O)(Oc2ccc(NC(C)=O)cc2)C2N(Cc3ccccc23)C(=O)[C@@H](N)CCCCN)cc1
: