Target
Cytochrome P450 3A4
Ligand
BDBM50226664
Substrate
Meas. Tech.
ChEMBL_459885 (CHEMBL942995)
IC50
30600±n/a nM
Citation
 Su, CRUeng, YFDung, NXVijaya Bhaskar Reddy, MWu, TS Cytochrome P3A4 inhibitors and other constituents of Fibraurea tinctoria. J Nat Prod 70:1930-3 (2007)  
Target
Name:
Cytochrome P450 3A4
Synonyms:
Albendazole monooxygenase CP3A4_HUMAN CYP3A4 CYPIIIA4 Cytochrome P450 3A4 (CYP3A4) Nifedipine oxidase Taurochenodeoxycholate 6-alpha-hydroxylase
Type:
Enzyme
Mol. Mass.:
57349.57
Organism:
Homo sapiens (Human)
Description:
Residue:
503
  
Inhibitor
Name:
BDBM50226664
Synonyms:
2-hydroxy-3,9,10-trimethoxy-5,6-dihydroisoquino[3,2-a]isoquinolinium columbamine
Type:
Small organic molecule
Emp. Form.:
C20H20NO4
Mol. Mass.:
338.3766
SMILES:
COc1cc2CC[n+]3cc4c(OC)c(OC)ccc4cc3-c2cc1O
: