Target
Protein kinase C epsilon type
Ligand
BDBM50229772
Substrate
Meas. Tech.
ChEMBL_460214 (CHEMBL927264)
Ki
0.470000±n/a nM
Citation
 Yanagita, RCNakagawa, YYamanaka, NKashiwagi, KSaito, NIrie, K Synthesis, conformational analysis, and biological evaluation of 1-hexylindolactam-V10 as a selective activator for novel protein kinase C isozymes. J Med Chem 51:46-56 (2008)  
Target
Name:
Protein kinase C epsilon type
Synonyms:
KPCE_HUMAN PKCE Protein kinase C epsilon Protein kinase C, PKC; classical/novel nPKC-epsilon
Type:
Enzyme
Mol. Mass.:
83680.45
Organism:
Homo sapiens (Human)
Description:
The recombinant human PKC enzymes were produced using a baculovirus expression system in SF9 cells
Residue:
737
  
Inhibitor
Name:
BDBM50229772
Synonyms:
1-hexylindolactam-V | CHEMBL399981
Type:
Small organic molecule
Emp. Form.:
C23H35N3O2
Mol. Mass.:
385.5429
SMILES:
CCCCCCn1cc2C[C@@H](CO)NC(=O)[C@H](C(C)C)N(C)c3cccc1c23
: