Target
Transketolase
Ligand
BDBM50230586
Substrate
Meas. Tech.
ChEMBL_461927 (CHEMBL944774)
EC50
15±n/a nM
Citation
 Le Huerou, YGunawardana, IThomas, AABoyd, SAde Meese, JDewolf, WGonzales, SSHan, MHayter, LKaplan, TLemieux, CLee, PPheneger, JPoch, GRomoff, TTSullivan, FWeiler, SWright, SKLin, J Prodrug thiamine analogs as inhibitors of the enzyme transketolase. Bioorg Med Chem Lett 18:505-8 (2008)  
Target
Name:
Transketolase
Synonyms:
TK TKT_HUMAN
Type:
PROTEIN
Mol. Mass.:
67886.43
Organism:
Homo sapiens (Human)
Description:
ChEMBL_468615
Residue:
623
  
Inhibitor
Name:
BDBM50230586
Synonyms:
CHEMBL252845 | N-((2-amino-6-methylpyridin-3-yl)methyl)-N-(1-(2-oxo-1,3-oxathian-4-ylidene)ethyl)formamide
Type:
Small organic molecule
Emp. Form.:
C14H17N3O3S
Mol. Mass.:
307.368
SMILES:
C\C(N(Cc1ccc(C)nc1N)C=O)=C1/CCOC(=O)S1
: