Target
Transketolase
Ligand
BDBM50230587
Substrate
Meas. Tech.
ChEMBL_461927 (CHEMBL944774)
EC50
12±n/a nM
Citation
 Le Huerou, YGunawardana, IThomas, AABoyd, SAde Meese, JDewolf, WGonzales, SSHan, MHayter, LKaplan, TLemieux, CLee, PPheneger, JPoch, GRomoff, TTSullivan, FWeiler, SWright, SKLin, J Prodrug thiamine analogs as inhibitors of the enzyme transketolase. Bioorg Med Chem Lett 18:505-8 (2008)  
Target
Name:
Transketolase
Synonyms:
TK TKT_HUMAN
Type:
PROTEIN
Mol. Mass.:
67886.43
Organism:
Homo sapiens (Human)
Description:
ChEMBL_468615
Residue:
623
  
Inhibitor
Name:
BDBM50230587
Synonyms:
CHEMBL440237 | N-(2-amino-6-methyl-pyridin-3-ylmethyl)-N-{2-[2-[(2-amino-6-methyl-pyridin-3-ylmethyl)-formyl-amino]-1-(2-hydroxy-ethyl)-propenyldisulfanyl]-4-hydroxy-1-methyl-but-1-enyl}-formamide
Type:
Small organic molecule
Emp. Form.:
C26H36N6O4S2
Mol. Mass.:
560.732
SMILES:
C\C(N(Cc1ccc(C)nc1N)C=O)=C(/CCO)SS\C(CCO)=C(\C)N(Cc1ccc(C)nc1N)C=O
: