Target
Transketolase
Ligand
BDBM50230589
Substrate
Meas. Tech.
ChEMBL_461927 (CHEMBL944774)
EC50
110±n/a nM
Citation
 Le Huerou, YGunawardana, IThomas, AABoyd, SAde Meese, JDewolf, WGonzales, SSHan, MHayter, LKaplan, TLemieux, CLee, PPheneger, JPoch, GRomoff, TTSullivan, FWeiler, SWright, SKLin, J Prodrug thiamine analogs as inhibitors of the enzyme transketolase. Bioorg Med Chem Lett 18:505-8 (2008)  
Target
Name:
Transketolase
Synonyms:
TK TKT_HUMAN
Type:
PROTEIN
Mol. Mass.:
67886.43
Organism:
Homo sapiens (Human)
Description:
ChEMBL_468615
Residue:
623
  
Inhibitor
Name:
BDBM50230589
Synonyms:
3-(2-amino-pyridin-3-ylmethyl)-5-(2-hydroxy-ethyl)-4-methyl-thiazol-3-ium; chloride CHEMBL403365
Type:
Small organic molecule
Emp. Form.:
C12H16N3OS
Mol. Mass.:
250.339
SMILES:
Cc1c(CCO)sc[n+]1Cc1cccnc1N
: