Target
Transketolase
Ligand
BDBM50230591
Substrate
Meas. Tech.
ChEMBL_461927 (CHEMBL944774)
EC50
8±n/a nM
Citation
 Le Huerou, YGunawardana, IThomas, AABoyd, SAde Meese, JDewolf, WGonzales, SSHan, MHayter, LKaplan, TLemieux, CLee, PPheneger, JPoch, GRomoff, TTSullivan, FWeiler, SWright, SKLin, J Prodrug thiamine analogs as inhibitors of the enzyme transketolase. Bioorg Med Chem Lett 18:505-8 (2008)  
Target
Name:
Transketolase
Synonyms:
TK TKT_HUMAN
Type:
PROTEIN
Mol. Mass.:
67886.43
Organism:
Homo sapiens (Human)
Description:
ChEMBL_468615
Residue:
623
  
Inhibitor
Name:
BDBM50230591
Synonyms:
3-(acetylthio)-4-(N-((2-amino-6-methylpyridin-3-yl)methyl)formamido)pent-3-enyl acetate | CHEMBL252843
Type:
Small organic molecule
Emp. Form.:
C17H23N3O4S
Mol. Mass.:
365.447
SMILES:
CC(=O)OCC\C(SC(C)=O)=C(/C)N(Cc1ccc(C)nc1N)C=O
: