Target
Transketolase
Ligand
BDBM50230594
Substrate
Meas. Tech.
ChEMBL_461927 (CHEMBL944774)
EC50
116±n/a nM
Citation
 Le Huerou, YGunawardana, IThomas, AABoyd, SAde Meese, JDewolf, WGonzales, SSHan, MHayter, LKaplan, TLemieux, CLee, PPheneger, JPoch, GRomoff, TTSullivan, FWeiler, SWright, SKLin, J Prodrug thiamine analogs as inhibitors of the enzyme transketolase. Bioorg Med Chem Lett 18:505-8 (2008)  
Target
Name:
Transketolase
Synonyms:
TK TKT_HUMAN
Type:
PROTEIN
Mol. Mass.:
67886.43
Organism:
Homo sapiens (Human)
Description:
ChEMBL_468615
Residue:
623
  
Inhibitor
Name:
BDBM50230594
Synonyms:
(4-(N-((2-amino-6-methylpyridin-3-yl)methyl)formamido)-1-hydroxypent-3-en-3-ylthio)methyl pivalate | CHEMBL253044
Type:
Small organic molecule
Emp. Form.:
C19H29N3O4S
Mol. Mass.:
395.516
SMILES:
C\C(N(Cc1ccc(C)nc1N)C=O)=C(/CCO)SCOC(=O)C(C)(C)C
: