Target
Transketolase
Ligand
BDBM50230597
Substrate
Meas. Tech.
ChEMBL_461927 (CHEMBL944774)
EC50
28±n/a nM
Citation
 Le Huerou, YGunawardana, IThomas, AABoyd, SAde Meese, JDewolf, WGonzales, SSHan, MHayter, LKaplan, TLemieux, CLee, PPheneger, JPoch, GRomoff, TTSullivan, FWeiler, SWright, SKLin, J Prodrug thiamine analogs as inhibitors of the enzyme transketolase. Bioorg Med Chem Lett 18:505-8 (2008)  
Target
Name:
Transketolase
Synonyms:
TK TKT_HUMAN
Type:
PROTEIN
Mol. Mass.:
67886.43
Organism:
Homo sapiens (Human)
Description:
ChEMBL_468615
Residue:
623
  
Inhibitor
Name:
BDBM50230597
Synonyms:
4-(N-((2-amino-6-methylpyridin-3-yl)methyl)formamido)-3-(benzoylthio)pent-3-enyl benzoate | CHEMBL252844
Type:
Small organic molecule
Emp. Form.:
C27H27N3O4S
Mol. Mass.:
489.586
SMILES:
C\C(N(Cc1ccc(C)nc1N)C=O)=C(/CCOC(=O)c1ccccc1)SC(=O)c1ccccc1
: