Target
Transketolase
Ligand
BDBM50230598
Substrate
Meas. Tech.
ChEMBL_461927 (CHEMBL944774)
EC50
13±n/a nM
Citation
 Le Huerou, YGunawardana, IThomas, AABoyd, SAde Meese, JDewolf, WGonzales, SSHan, MHayter, LKaplan, TLemieux, CLee, PPheneger, JPoch, GRomoff, TTSullivan, FWeiler, SWright, SKLin, J Prodrug thiamine analogs as inhibitors of the enzyme transketolase. Bioorg Med Chem Lett 18:505-8 (2008)  
Target
Name:
Transketolase
Synonyms:
TK TKT_HUMAN
Type:
PROTEIN
Mol. Mass.:
67886.43
Organism:
Homo sapiens (Human)
Description:
ChEMBL_468615
Residue:
623
  
Inhibitor
Name:
BDBM50230598
Synonyms:
CHEMBL253045 | N-((2-amino-6-methylpyridin-3-yl)methyl)-N-(5-hydroxy-3-(2-(2-hydroxyethyl)disulfanyl)pent-2-en-2-yl)formamide
Type:
Small organic molecule
Emp. Form.:
C15H23N3O3S2
Mol. Mass.:
357.491
SMILES:
C\C(N(Cc1ccc(C)nc1N)C=O)=C(/CCO)SSCCO
: