Target
Transketolase
Ligand
BDBM50230601
Substrate
Meas. Tech.
ChEMBL_461927 (CHEMBL944774)
EC50
6000±n/a nM
Citation
 Le Huerou, YGunawardana, IThomas, AABoyd, SAde Meese, JDewolf, WGonzales, SSHan, MHayter, LKaplan, TLemieux, CLee, PPheneger, JPoch, GRomoff, TTSullivan, FWeiler, SWright, SKLin, J Prodrug thiamine analogs as inhibitors of the enzyme transketolase. Bioorg Med Chem Lett 18:505-8 (2008)  
Target
Name:
Transketolase
Synonyms:
TK TKT_HUMAN
Type:
PROTEIN
Mol. Mass.:
67886.43
Organism:
Homo sapiens (Human)
Description:
ChEMBL_468615
Residue:
623
  
Inhibitor
Name:
BDBM50230601
Synonyms:
CHEMBL401964 | N-((2-amino-6-methylpyridin-3-yl)methyl)-N-(3-(butylthio)-5-hydroxypent-2-en-2-yl)formamide
Type:
Small organic molecule
Emp. Form.:
C17H27N3O2S
Mol. Mass.:
337.48
SMILES:
CCCCS\C(CCO)=C(\C)N(Cc1ccc(C)nc1N)C=O
: