Target
5-hydroxytryptamine receptor 7
Ligand
BDBM50009001
Substrate
Meas. Tech.
ChEMBL_503750 (CHEMBL991220)
IC50
>350000±n/a nM
Citation
 Gafner, SBergeron, CBatcha, LLReich, JArnason, JTBurdette, JEPezzuto, JMAngerhofer, CK Inhibition of [3H]-LSD binding to 5-HT7 receptors by flavonoids from Scutellaria lateriflora. J Nat Prod 66:535-7 (2003)  
Target
Name:
5-hydroxytryptamine receptor 7
Synonyms:
5-HT-7 5-HT7 5-HT7S 5HT7 HTR7 | Serotonin receptor 7
Type:
G Protein-Coupled Receptor (GPCR)
Mol. Mass.:
53573.08
Organism:
Homo sapiens (Human)
Description:
P34969
Residue:
479
  
Inhibitor
Name:
BDBM50009001
Synonyms:
5,6,7-Trihydroxyflavone Baicalein Baicalein, 8 US10252984, Table 2.33
Type:
Small organic molecule
Emp. Form.:
C15H10O5
Mol. Mass.:
270.2369
SMILES:
Oc1cc2oc(cc(=O)c2c(O)c1O)-c1ccccc1
: