Target
5-hydroxytryptamine receptor 7
Ligand
BDBM50250625
Substrate
Meas. Tech.
ChEMBL_503750 (CHEMBL991220)
IC50
179000±n/a nM
Citation
 Gafner, SBergeron, CBatcha, LLReich, JArnason, JTBurdette, JEPezzuto, JMAngerhofer, CK Inhibition of [3H]-LSD binding to 5-HT7 receptors by flavonoids from Scutellaria lateriflora. J Nat Prod 66:535-7 (2003)  
Target
Name:
5-hydroxytryptamine receptor 7
Synonyms:
5-HT-7 5-HT7 5-HT7S 5HT7 HTR7 | Serotonin receptor 7
Type:
G Protein-Coupled Receptor (GPCR)
Mol. Mass.:
53573.08
Organism:
Homo sapiens (Human)
Description:
P34969
Residue:
479
  
Inhibitor
Name:
BDBM50250625
Synonyms:
CHEMBL467197 | dihydrobaicalin
Type:
Small organic molecule
Emp. Form.:
C21H20O11
Mol. Mass.:
448.3769
SMILES:
O[C@@H]1[C@@H](O)[C@H](Oc2cc3O[C@@H](CC(=O)c3c(O)c2O)c2ccccc2)O[C@@H]([C@H]1O)C(O)=O
: