Target
5-hydroxytryptamine receptor 7
Ligand
BDBM50242284
Substrate
Meas. Tech.
ChEMBL_503750 (CHEMBL991220)
IC50
63400±n/a nM
Citation
 Gafner, SBergeron, CBatcha, LLReich, JArnason, JTBurdette, JEPezzuto, JMAngerhofer, CK Inhibition of [3H]-LSD binding to 5-HT7 receptors by flavonoids from Scutellaria lateriflora. J Nat Prod 66:535-7 (2003)  
Target
Name:
5-hydroxytryptamine receptor 7
Synonyms:
5-HT-7 5-HT7 5-HT7S 5HT7 HTR7 | Serotonin receptor 7
Type:
G Protein-Coupled Receptor (GPCR)
Mol. Mass.:
53573.08
Organism:
Homo sapiens (Human)
Description:
P34969
Residue:
479
  
Inhibitor
Name:
BDBM50242284
Synonyms:
CHEMBL487805 | scutellarin
Type:
Small organic molecule
Emp. Form.:
C21H18O12
Mol. Mass.:
462.3604
SMILES:
O[C@H]1[C@H](Oc2cc3oc(cc(=O)c3c(O)c2O)-c2ccc(O)cc2)O[C@@H]([C@@H](O)[C@@H]1O)C(O)=O
: