Target
5-hydroxytryptamine receptor 7
Ligand
BDBM50242173
Substrate
Meas. Tech.
ChEMBL_503750 (CHEMBL991220)
IC50
>200000±n/a nM
Citation
 Gafner, SBergeron, CBatcha, LLReich, JArnason, JTBurdette, JEPezzuto, JMAngerhofer, CK Inhibition of [3H]-LSD binding to 5-HT7 receptors by flavonoids from Scutellaria lateriflora. J Nat Prod 66:535-7 (2003)  
Target
Name:
5-hydroxytryptamine receptor 7
Synonyms:
5-HT-7 5-HT7 5-HT7S 5HT7 HTR7 | Serotonin receptor 7
Type:
G Protein-Coupled Receptor (GPCR)
Mol. Mass.:
53573.08
Organism:
Homo sapiens (Human)
Description:
P34969
Residue:
479
  
Inhibitor
Name:
BDBM50242173
Synonyms:
(2S,3S,4S,5R,6S)-6-(5,6-dihydroxy-4-oxo-2-phenyl-4H-chromen-7-yloxy)-3,4,5-trihydroxy-tetrahydro-2H-pyran-2-carboxylic acid Baicalin (9) baicalin
Type:
Small organic molecule
Emp. Form.:
C21H18O11
Mol. Mass.:
446.361
SMILES:
O[C@H]1[C@H](Oc2cc3oc(cc(=O)c3c(O)c2O)-c2ccccc2)O[C@@H]([C@@H](O)[C@@H]1O)C(O)=O
: