Target
Macrophage-stimulating protein receptor
Ligand
BDBM482158
Substrate
Meas. Tech.
ChEMBL_508995 (CHEMBL1006336)
IC50
1634±n/a nM
Citation
 Galkin, AVMelnick, JSKim, SHood, TLLi, NLi, LXia, GSteensma, RChopiuk, GJiang, JWan, YDing, PLiu, YSun, FSchultz, PGGray, NSWarmuth, M Identification of NVP-TAE684, a potent, selective, and efficacious inhibitor of NPM-ALK. Proc Natl Acad Sci U S A 104:270-5 (2007)  
Target
Name:
Macrophage-stimulating protein receptor
Synonyms:
2.7.10.1 CDw136 MST1R Macrophage-stimulating protein receptor alpha chain PTK8 RON Tyrosine kinase receptor ron | p185-Ron
Type:
Protein
Mol. Mass.:
152270.76
Organism:
Homo sapiens (Human)
Description:
Q04912
Residue:
1400
  
Inhibitor
Name:
BDBM482158
Synonyms:
BDBM50242742 | TAE684
Type:
Emp. Form.:
C30H40ClN7O3S
Mol. Mass.:
614.202
SMILES:
COc1cc(ccc1Nc1ncc(Cl)c(Nc2ccccc2S(=O)(=O)C(C)C)n1)N1CCC(CC1)N1CCN(C)CC1
: