Target
Histidinol dehydrogenase
Ligand
BDBM50267975
Substrate
Meas. Tech.
ChEMBL_565320 (CHEMBL955161)
IC50
6±n/a nM
Citation
 Joseph, PAbdo, MRBoigegrain, RAMontero, JLWinum, JYKöhler, S Targeting of the Brucella suis virulence factor histidinol dehydrogenase by histidinol analogues results in inhibition of intramacrophagic multiplication of the pathogen. Antimicrob Agents Chemother 51:3752-5 (2007)  
Target
Name:
Histidinol dehydrogenase
Synonyms:
HISX_BRUSU | hisD
Type:
PROTEIN
Mol. Mass.:
46060.70
Organism:
Brucella suis
Description:
ChEMBL_436509
Residue:
430
  
Inhibitor
Name:
BDBM50267975
Synonyms:
(S)-3-Amino-1-(4-bromo-phenyl)-4-(1H-imidazol-4-yl)-butan-2-one; dihydrochloride CHEMBL483667
Type:
Small organic molecule
Emp. Form.:
C13H14BrN3O
Mol. Mass.:
308.174
SMILES:
N[C@@H](Cc1cnc[nH]1)C(=O)Cc1ccc(Br)cc1
: