Target
D(2) dopamine receptor
Ligand
BDBM50251028
Substrate
Meas. Tech.
ChEMBL_529942 (CHEMBL975013)
Ki
21±n/a nM
Citation
 Sipos, AKiss, BSchmidt, EGreiner, IBerényi, S Synthesis and neuropharmacological evaluation of 2-aryl- and alkylapomorphines. Bioorg Med Chem 16:3773-9 (2008)  
Target
Name:
D(2) dopamine receptor
Synonyms:
DOPAMINE D2 DOPAMINE D2 Short Dopamine D2 receptor Drd2
Type:
G Protein-Coupled Receptor (GPCR)
Mol. Mass.:
50931.60
Organism:
Rattus norvegicus (rat)
Description:
P61169
Residue:
444
  
Inhibitor
Name:
BDBM50251028
Synonyms:
(R)-(-)-2-Methyl-apomorphine hydrochloride CHEMBL557547
Type:
Small organic molecule
Emp. Form.:
C18H19NO2
Mol. Mass.:
281.349
SMILES:
CN1CCc2cc(C)cc-3c2[C@H]1Cc1ccc(O)c(O)c-31
: