Target
Adenosine receptor A1
Ligand
BDBM50271536
Substrate
Meas. Tech.
ChEMBL_556456 (CHEMBL955673)
Ki
12.3±n/a nM
Citation
 Colotta, VCatarzi, DVarano, FLenzi, OFilacchioni, GMartini, CTrincavelli, LCiampi, OTraini, CPugliese, AMPedata, FMorizzo, EMoro, S Synthesis, ligand-receptor modeling studies and pharmacological evaluation of novel 4-modified-2-aryl-1,2,4-triazolo[4,3-a]quinoxalin-1-one derivatives as potent and selective human A3 adenosine receptor antagonists. Bioorg Med Chem 16:6086-102 (2008)  
Target
Name:
Adenosine receptor A1
Synonyms:
A1 adenosine receptor (hA1) AA1R_HUMAN ADORA1 Adenosine A1-receptor Adenosine receptor A1 (hA1) | Adenosine transporter (AdT)
Type:
G Protein-Coupled Receptor (GPCR)
Mol. Mass.:
36520.92
Organism:
Homo sapiens (Human)
Description:
P30542
Residue:
326
  
Inhibitor
Name:
BDBM50271536
Synonyms:
4-benzylureido-1,2-dihydro-2-phenyl-1,2,4-triazolo[4,3-a]quinoxalin-1-one | CHEMBL508203
Type:
Small organic molecule
Emp. Form.:
C23H18N6O2
Mol. Mass.:
410.428
SMILES:
O=C(NCc1ccccc1)Nc1nc2ccccc2n2c1nn(-c1ccccc1)c2=O
: