Target
Adenosine receptor A1
Ligand
BDBM50271449
Substrate
Meas. Tech.
ChEMBL_556460 (CHEMBL955677)
Ki
157±n/a nM
Citation
 Colotta, VCatarzi, DVarano, FLenzi, OFilacchioni, GMartini, CTrincavelli, LCiampi, OTraini, CPugliese, AMPedata, FMorizzo, EMoro, S Synthesis, ligand-receptor modeling studies and pharmacological evaluation of novel 4-modified-2-aryl-1,2,4-triazolo[4,3-a]quinoxalin-1-one derivatives as potent and selective human A3 adenosine receptor antagonists. Bioorg Med Chem 16:6086-102 (2008)  
Target
Name:
Adenosine receptor A1
Synonyms:
AA1R_BOVIN ADENOSINE A1 high ADORA1 | Adenosine A1 receptor
Type:
Enzyme Catalytic Domain
Mol. Mass.:
36602.99
Organism:
BOVINE
Description:
ADENOSINE 0 BOVINE::P28190
Residue:
326
  
Inhibitor
Name:
BDBM50271449
Synonyms:
CHEMBL482504 | N-(1-oxo-2-phenyl-1,2-dihydro-[1,2,4]triazolo[4,3-a]quinoxalin-4-yl)benzenesulfonamide
Type:
Small organic molecule
Emp. Form.:
C21H15N5O3S
Mol. Mass.:
417.441
SMILES:
O=c1n(nc2c(NS(=O)(=O)c3ccccc3)nc3ccccc3n12)-c1ccccc1
: