Target
Adenosine receptor A1
Ligand
BDBM50272032
Substrate
Meas. Tech.
ChEMBL_556460 (CHEMBL955677)
Ki
236±n/a nM
Citation
 Colotta, VCatarzi, DVarano, FLenzi, OFilacchioni, GMartini, CTrincavelli, LCiampi, OTraini, CPugliese, AMPedata, FMorizzo, EMoro, S Synthesis, ligand-receptor modeling studies and pharmacological evaluation of novel 4-modified-2-aryl-1,2,4-triazolo[4,3-a]quinoxalin-1-one derivatives as potent and selective human A3 adenosine receptor antagonists. Bioorg Med Chem 16:6086-102 (2008)  
Target
Name:
Adenosine receptor A1
Synonyms:
AA1R_BOVIN ADENOSINE A1 high ADORA1 | Adenosine A1 receptor
Type:
Enzyme Catalytic Domain
Mol. Mass.:
36602.99
Organism:
BOVINE
Description:
ADENOSINE 0 BOVINE::P28190
Residue:
326
  
Inhibitor
Name:
BDBM50272032
Synonyms:
CHEMBL526134 | N-(2-(4-methoxyphenyl)-1-oxo-1,2-dihydro-[1,2,4]triazolo[4,3-a]quinoxalin-4-yl)isonicotinamide
Type:
Small organic molecule
Emp. Form.:
C22H16N6O3
Mol. Mass.:
412.4008
SMILES:
COc1ccc(cc1)-n1nc2c(NC(=O)c3ccncc3)nc3ccccc3n2c1=O
: