Target
Adenosine receptor A3
Ligand
BDBM50271580
Substrate
Meas. Tech.
ChEMBL_556454 (CHEMBL955671)
Ki
6.4±n/a nM
Citation
 Colotta, VCatarzi, DVarano, FLenzi, OFilacchioni, GMartini, CTrincavelli, LCiampi, OTraini, CPugliese, AMPedata, FMorizzo, EMoro, S Synthesis, ligand-receptor modeling studies and pharmacological evaluation of novel 4-modified-2-aryl-1,2,4-triazolo[4,3-a]quinoxalin-1-one derivatives as potent and selective human A3 adenosine receptor antagonists. Bioorg Med Chem 16:6086-102 (2008)  
Target
Name:
Adenosine receptor A3
Synonyms:
A3 adenosine receptor (hA3) ADORA3 | Adenosine A3 receptor (A3AR)
Type:
G Protein-Coupled Receptor (GPCR)
Mol. Mass.:
36197.32
Organism:
Homo sapiens (Human)
Description:
P0DMS8
Residue:
318
  
Inhibitor
Name:
BDBM50271580
Synonyms:
4-(benzyloxy)-2-(4-methoxyphenyl)-[1,2,4]triazolo[4,3-a]quinoxalin-1(2H)-one | CHEMBL484721
Type:
Small organic molecule
Emp. Form.:
C23H18N4O3
Mol. Mass.:
398.414
SMILES:
COc1ccc(cc1)-n1nc2c(OCc3ccccc3)nc3ccccc3n2c1=O
: