Target
Adenosine receptor A3
Ligand
BDBM50271449
Substrate
Meas. Tech.
ChEMBL_556454 (CHEMBL955671)
Ki
32.2±n/a nM
Citation
 Colotta, VCatarzi, DVarano, FLenzi, OFilacchioni, GMartini, CTrincavelli, LCiampi, OTraini, CPugliese, AMPedata, FMorizzo, EMoro, S Synthesis, ligand-receptor modeling studies and pharmacological evaluation of novel 4-modified-2-aryl-1,2,4-triazolo[4,3-a]quinoxalin-1-one derivatives as potent and selective human A3 adenosine receptor antagonists. Bioorg Med Chem 16:6086-102 (2008)  
Target
Name:
Adenosine receptor A3
Synonyms:
A3 adenosine receptor (hA3) ADORA3 | Adenosine A3 receptor (A3AR)
Type:
G Protein-Coupled Receptor (GPCR)
Mol. Mass.:
36197.32
Organism:
Homo sapiens (Human)
Description:
P0DMS8
Residue:
318
  
Inhibitor
Name:
BDBM50271449
Synonyms:
CHEMBL482504 | N-(1-oxo-2-phenyl-1,2-dihydro-[1,2,4]triazolo[4,3-a]quinoxalin-4-yl)benzenesulfonamide
Type:
Small organic molecule
Emp. Form.:
C21H15N5O3S
Mol. Mass.:
417.441
SMILES:
O=c1n(nc2c(NS(=O)(=O)c3ccccc3)nc3ccccc3n12)-c1ccccc1
: