Target
Adenosine receptor A3
Ligand
BDBM50271305
Substrate
Meas. Tech.
ChEMBL_556454 (CHEMBL955671)
Ki
1370±n/a nM
Citation
 Colotta, VCatarzi, DVarano, FLenzi, OFilacchioni, GMartini, CTrincavelli, LCiampi, OTraini, CPugliese, AMPedata, FMorizzo, EMoro, S Synthesis, ligand-receptor modeling studies and pharmacological evaluation of novel 4-modified-2-aryl-1,2,4-triazolo[4,3-a]quinoxalin-1-one derivatives as potent and selective human A3 adenosine receptor antagonists. Bioorg Med Chem 16:6086-102 (2008)  
Target
Name:
Adenosine receptor A3
Synonyms:
A3 adenosine receptor (hA3) ADORA3 | Adenosine A3 receptor (A3AR)
Type:
G Protein-Coupled Receptor (GPCR)
Mol. Mass.:
36197.32
Organism:
Homo sapiens (Human)
Description:
P0DMS8
Residue:
318
  
Inhibitor
Name:
BDBM50271305
Synonyms:
CHEMBL484299 | methyl 4-((2-(4-methoxyphenyl)-1-oxo-1,2-dihydro-[1,2,4]triazolo[4,3-a]quinoxalin-4-yl)carbamoyl)benzoate
Type:
Small organic molecule
Emp. Form.:
C25H19N5O5
Mol. Mass.:
469.4489
SMILES:
COC(=O)c1ccc(cc1)C(=O)Nc1nc2ccccc2n2c1nn(-c1ccc(OC)cc1)c2=O
: