Target
Dipeptidyl peptidase 4
Ligand
BDBM50244012
Substrate
Meas. Tech.
ChEMBL_555161 (CHEMBL965322)
IC50
100±n/a nM
Citation
 Liang, GBQian, XBiftu, TSingh, SGao, YDScapin, GPatel, SLeiting, BPatel, RWu, JZhang, XThornberry, NAWeber, AE Discovery of new binding elements in DPP-4 inhibition and their applications in novel DPP-4 inhibitor design. Bioorg Med Chem Lett 18:3706-10 (2008)  
Target
Name:
Dipeptidyl peptidase 4
Synonyms:
ADABP Adenosine deaminase complexing protein 2 CD_antigen=CD26 DPP4 DPPIV Dipeptidyl peptidase 4 (DPP IV) Dipeptidyl peptidase 4 (DPP4) Dipeptidyl peptidase 4 membrane form Dipeptidyl peptidase IV Dipeptidyl peptidase IV (DDP-IV) Dipeptidyl peptidase IV membrane form Dipeptidyl peptidase-IV (DPP-4) T-cell activation antigen CD26 | TP103
Type:
Enzyme
Mol. Mass.:
88271.01
Organism:
Homo sapiens (Human)
Description:
P27487
Residue:
766
  
Inhibitor
Name:
BDBM50244012
Synonyms:
4'-[(1S,2S)-2-Amino-3-((S)-3-fluoro-pyrrolidin-1-yl)-1-methyl-3-oxo-propyl]-biphenyl-3-carboxylic acid amide | CHEMBL452290
Type:
Small organic molecule
Emp. Form.:
C21H24FN3O2
Mol. Mass.:
369.4326
SMILES:
C[C@H]([C@H](N)C(=O)N1CC[C@H](F)C1)c1ccc(cc1)-c1cccc(c1)C(N)=O
: