Target
Dipeptidyl peptidase 4
Ligand
BDBM50243914
Substrate
Meas. Tech.
ChEMBL_555161 (CHEMBL965322)
IC50
4400±n/a nM
Citation
 Liang, GBQian, XBiftu, TSingh, SGao, YDScapin, GPatel, SLeiting, BPatel, RWu, JZhang, XThornberry, NAWeber, AE Discovery of new binding elements in DPP-4 inhibition and their applications in novel DPP-4 inhibitor design. Bioorg Med Chem Lett 18:3706-10 (2008)  
Target
Name:
Dipeptidyl peptidase 4
Synonyms:
ADABP Adenosine deaminase complexing protein 2 CD_antigen=CD26 DPP4 DPPIV Dipeptidyl peptidase 4 (DPP IV) Dipeptidyl peptidase 4 (DPP4) Dipeptidyl peptidase 4 membrane form Dipeptidyl peptidase IV Dipeptidyl peptidase IV (DDP-IV) Dipeptidyl peptidase IV membrane form Dipeptidyl peptidase-IV (DPP-4) T-cell activation antigen CD26 | TP103
Type:
Enzyme
Mol. Mass.:
88271.01
Organism:
Homo sapiens (Human)
Description:
P27487
Residue:
766
  
Inhibitor
Name:
BDBM50243914
Synonyms:
(2R,3R)-1-(2,5-difluorophenyl)-3-(3-(4-(trifluoromethoxy)phenyl)-1,2,4-oxadiazol-5-yl)butan-2-amine | CHEMBL520067
Type:
Small organic molecule
Emp. Form.:
C19H16F5N3O2
Mol. Mass.:
413.3413
SMILES:
C[C@H]([C@H](N)Cc1cc(F)ccc1F)c1nc(no1)-c1ccc(OC(F)(F)F)cc1
: