Target
Dipeptidyl peptidase 4
Ligand
BDBM50243864
Substrate
Meas. Tech.
ChEMBL_555161 (CHEMBL965322)
IC50
200±n/a nM
Citation
 Liang, GBQian, XBiftu, TSingh, SGao, YDScapin, GPatel, SLeiting, BPatel, RWu, JZhang, XThornberry, NAWeber, AE Discovery of new binding elements in DPP-4 inhibition and their applications in novel DPP-4 inhibitor design. Bioorg Med Chem Lett 18:3706-10 (2008)  
Target
Name:
Dipeptidyl peptidase 4
Synonyms:
ADABP Adenosine deaminase complexing protein 2 CD_antigen=CD26 DPP4 DPPIV Dipeptidyl peptidase 4 (DPP IV) Dipeptidyl peptidase 4 (DPP4) Dipeptidyl peptidase 4 membrane form Dipeptidyl peptidase IV Dipeptidyl peptidase IV (DDP-IV) Dipeptidyl peptidase IV membrane form Dipeptidyl peptidase-IV (DPP-4) T-cell activation antigen CD26 | TP103
Type:
Enzyme
Mol. Mass.:
88271.01
Organism:
Homo sapiens (Human)
Description:
P27487
Residue:
766
  
Inhibitor
Name:
BDBM50243864
Synonyms:
(R)-3-amino-4-(2,5-difluorophenyl)-1-((S)-2-(hydroxymethyl)pyrrolidin-1-yl)butan-1-one | CHEMBL488484
Type:
Small organic molecule
Emp. Form.:
C15H20F2N2O2
Mol. Mass.:
298.3283
SMILES:
N[C@@H](CC(=O)N1CCC[C@H]1CO)Cc1cc(F)ccc1F
: