Target
Dipeptidyl peptidase 4
Ligand
BDBM50151804
Substrate
Meas. Tech.
ChEMBL_555161 (CHEMBL965322)
IC50
270±n/a nM
Citation
 Liang, GBQian, XBiftu, TSingh, SGao, YDScapin, GPatel, SLeiting, BPatel, RWu, JZhang, XThornberry, NAWeber, AE Discovery of new binding elements in DPP-4 inhibition and their applications in novel DPP-4 inhibitor design. Bioorg Med Chem Lett 18:3706-10 (2008)  
Target
Name:
Dipeptidyl peptidase 4
Synonyms:
ADABP Adenosine deaminase complexing protein 2 CD_antigen=CD26 DPP4 DPPIV Dipeptidyl peptidase 4 (DPP IV) Dipeptidyl peptidase 4 (DPP4) Dipeptidyl peptidase 4 membrane form Dipeptidyl peptidase IV Dipeptidyl peptidase IV (DDP-IV) Dipeptidyl peptidase IV membrane form Dipeptidyl peptidase-IV (DPP-4) T-cell activation antigen CD26 | TP103
Type:
Enzyme
Mol. Mass.:
88271.01
Organism:
Homo sapiens (Human)
Description:
P27487
Residue:
766
  
Inhibitor
Name:
BDBM50151804
Synonyms:
(R)-3-Amino-4-(2,5-difluoro-phenyl)-1-thiazolidin-3-yl-butan-1-one CHEMBL433572
Type:
Small organic molecule
Emp. Form.:
C13H16F2N2OS
Mol. Mass.:
286.341
SMILES:
N[C@@H](CC(=O)N1CCSC1)Cc1cc(F)ccc1F
: