Target
Dipeptidyl peptidase 8
Ligand
BDBM50244011
Substrate
Meas. Tech.
ChEMBL_555162 (CHEMBL965323)
IC50
>100000±n/a nM
Citation
 Liang, GBQian, XBiftu, TSingh, SGao, YDScapin, GPatel, SLeiting, BPatel, RWu, JZhang, XThornberry, NAWeber, AE Discovery of new binding elements in DPP-4 inhibition and their applications in novel DPP-4 inhibitor design. Bioorg Med Chem Lett 18:3706-10 (2008)  
Target
Name:
Dipeptidyl peptidase 8
Synonyms:
DPP8 DPRP-1 Dipeptidyl peptidase 8 (DPP-8) Dipeptidyl peptidase 8/9 Dipeptidyl peptidase VIII Prolyl dipeptidase DPP8
Type:
Enzyme
Mol. Mass.:
103342.62
Organism:
Homo sapiens (Human)
Description:
Q6V1X1
Residue:
898
  
Inhibitor
Name:
BDBM50244011
Synonyms:
4'-[(1R)-1-amino-2-(2,5-difluorophenyl)ethyl]biphenyl-3-carboxamide CHEMBL452289
Type:
Small organic molecule
Emp. Form.:
C21H18F2N2O
Mol. Mass.:
352.3772
SMILES:
N[C@H](Cc1cc(F)ccc1F)c1ccc(cc1)-c1cccc(c1)C(N)=O
: