Target
Dipeptidyl peptidase 8
Ligand
BDBM50243709
Substrate
Meas. Tech.
ChEMBL_555162 (CHEMBL965323)
IC50
>100000±n/a nM
Citation
 Liang, GBQian, XBiftu, TSingh, SGao, YDScapin, GPatel, SLeiting, BPatel, RWu, JZhang, XThornberry, NAWeber, AE Discovery of new binding elements in DPP-4 inhibition and their applications in novel DPP-4 inhibitor design. Bioorg Med Chem Lett 18:3706-10 (2008)  
Target
Name:
Dipeptidyl peptidase 8
Synonyms:
DPP8 DPRP-1 Dipeptidyl peptidase 8 (DPP-8) Dipeptidyl peptidase 8/9 Dipeptidyl peptidase VIII Prolyl dipeptidase DPP8
Type:
Enzyme
Mol. Mass.:
103342.62
Organism:
Homo sapiens (Human)
Description:
Q6V1X1
Residue:
898
  
Inhibitor
Name:
BDBM50243709
Synonyms:
(R)-1-(4-bromophenyl)-2-(2,5-difluorophenyl)ethanamine | CHEMBL504506
Type:
Small organic molecule
Emp. Form.:
C14H12BrF2N
Mol. Mass.:
312.153
SMILES:
N[C@H](Cc1cc(F)ccc1F)c1ccc(Br)cc1
: