Target
Dipeptidyl peptidase 8
Ligand
BDBM50243915
Substrate
Meas. Tech.
ChEMBL_555162 (CHEMBL965323)
IC50
>100000±n/a nM
Citation
 Liang, GBQian, XBiftu, TSingh, SGao, YDScapin, GPatel, SLeiting, BPatel, RWu, JZhang, XThornberry, NAWeber, AE Discovery of new binding elements in DPP-4 inhibition and their applications in novel DPP-4 inhibitor design. Bioorg Med Chem Lett 18:3706-10 (2008)  
Target
Name:
Dipeptidyl peptidase 8
Synonyms:
DPP8 DPRP-1 Dipeptidyl peptidase 8 (DPP-8) Dipeptidyl peptidase 8/9 Dipeptidyl peptidase VIII Prolyl dipeptidase DPP8
Type:
Enzyme
Mol. Mass.:
103342.62
Organism:
Homo sapiens (Human)
Description:
Q6V1X1
Residue:
898
  
Inhibitor
Name:
BDBM50243915
Synonyms:
(2S,3S)-2-amino-3-(3-(2,4-dichlorophenyl)-1,2,4-oxadiazol-5-yl)-1-((S)-3-fluoropyrrolidin-1-yl)butan-1-one | CHEMBL487630
Type:
Small organic molecule
Emp. Form.:
C16H17Cl2FN4O2
Mol. Mass.:
387.236
SMILES:
C[C@@H]([C@H](N)C(=O)N1CC[C@H](F)C1)c1nc(no1)-c1ccc(Cl)cc1Cl
: