Target
Dipeptidyl peptidase 8
Ligand
BDBM50243866
Substrate
Meas. Tech.
ChEMBL_555162 (CHEMBL965323)
IC50
>100000±n/a nM
Citation
 Liang, GBQian, XBiftu, TSingh, SGao, YDScapin, GPatel, SLeiting, BPatel, RWu, JZhang, XThornberry, NAWeber, AE Discovery of new binding elements in DPP-4 inhibition and their applications in novel DPP-4 inhibitor design. Bioorg Med Chem Lett 18:3706-10 (2008)  
Target
Name:
Dipeptidyl peptidase 8
Synonyms:
DPP8 DPRP-1 Dipeptidyl peptidase 8 (DPP-8) Dipeptidyl peptidase 8/9 Dipeptidyl peptidase VIII Prolyl dipeptidase DPP8
Type:
Enzyme
Mol. Mass.:
103342.62
Organism:
Homo sapiens (Human)
Description:
Q6V1X1
Residue:
898
  
Inhibitor
Name:
BDBM50243866
Synonyms:
(R)-3-amino-4-(2,5-difluorophenyl)-1-(3-methyl-1,2,4-oxadiazol-5-yl)butan-1-one | CHEMBL507719
Type:
Small organic molecule
Emp. Form.:
C13H13F2N3O2
Mol. Mass.:
281.258
SMILES:
Cc1noc(n1)C(=O)C[C@H](N)Cc1cc(F)ccc1F
: