Target
Dipeptidyl peptidase 8
Ligand
BDBM50244012
Substrate
Meas. Tech.
ChEMBL_555162 (CHEMBL965323)
IC50
39000±n/a nM
Citation
 Liang, GBQian, XBiftu, TSingh, SGao, YDScapin, GPatel, SLeiting, BPatel, RWu, JZhang, XThornberry, NAWeber, AE Discovery of new binding elements in DPP-4 inhibition and their applications in novel DPP-4 inhibitor design. Bioorg Med Chem Lett 18:3706-10 (2008)  
Target
Name:
Dipeptidyl peptidase 8
Synonyms:
DPP8 DPRP-1 Dipeptidyl peptidase 8 (DPP-8) Dipeptidyl peptidase 8/9 Dipeptidyl peptidase VIII Prolyl dipeptidase DPP8
Type:
Enzyme
Mol. Mass.:
103342.62
Organism:
Homo sapiens (Human)
Description:
Q6V1X1
Residue:
898
  
Inhibitor
Name:
BDBM50244012
Synonyms:
4'-[(1S,2S)-2-Amino-3-((S)-3-fluoro-pyrrolidin-1-yl)-1-methyl-3-oxo-propyl]-biphenyl-3-carboxylic acid amide | CHEMBL452290
Type:
Small organic molecule
Emp. Form.:
C21H24FN3O2
Mol. Mass.:
369.4326
SMILES:
C[C@H]([C@H](N)C(=O)N1CC[C@H](F)C1)c1ccc(cc1)-c1cccc(c1)C(N)=O
: