Target
Dipeptidyl peptidase 8
Ligand
BDBM50244356
Substrate
Meas. Tech.
ChEMBL_555162 (CHEMBL965323)
IC50
43000±n/a nM
Citation
 Liang, GBQian, XBiftu, TSingh, SGao, YDScapin, GPatel, SLeiting, BPatel, RWu, JZhang, XThornberry, NAWeber, AE Discovery of new binding elements in DPP-4 inhibition and their applications in novel DPP-4 inhibitor design. Bioorg Med Chem Lett 18:3706-10 (2008)  
Target
Name:
Dipeptidyl peptidase 8
Synonyms:
DPP8 DPRP-1 Dipeptidyl peptidase 8 (DPP-8) Dipeptidyl peptidase 8/9 Dipeptidyl peptidase VIII Prolyl dipeptidase DPP8
Type:
Enzyme
Mol. Mass.:
103342.62
Organism:
Homo sapiens (Human)
Description:
Q6V1X1
Residue:
898
  
Inhibitor
Name:
BDBM50244356
Synonyms:
(S)-1-(2-amino-4-oxo-4-(3-(trifluoromethyl)-5,6-dihydro-[1,2,4]triazolo[4,3-a]pyrazin-7(8H)-yl)butyl)piperidin-2-one | CHEMBL488678
Type:
Small organic molecule
Emp. Form.:
C15H21F3N6O2
Mol. Mass.:
374.3614
SMILES:
N[C@H](CN1CCCCC1=O)CC(=O)N1CCn2c(C1)nnc2C(F)(F)F
: