Target
Dipeptidyl peptidase 8
Ligand
BDBM50243865
Substrate
Meas. Tech.
ChEMBL_555162 (CHEMBL965323)
IC50
47000±n/a nM
Citation
 Liang, GBQian, XBiftu, TSingh, SGao, YDScapin, GPatel, SLeiting, BPatel, RWu, JZhang, XThornberry, NAWeber, AE Discovery of new binding elements in DPP-4 inhibition and their applications in novel DPP-4 inhibitor design. Bioorg Med Chem Lett 18:3706-10 (2008)  
Target
Name:
Dipeptidyl peptidase 8
Synonyms:
DPP8 DPRP-1 Dipeptidyl peptidase 8 (DPP-8) Dipeptidyl peptidase 8/9 Dipeptidyl peptidase VIII Prolyl dipeptidase DPP8
Type:
Enzyme
Mol. Mass.:
103342.62
Organism:
Homo sapiens (Human)
Description:
Q6V1X1
Residue:
898
  
Inhibitor
Name:
BDBM50243865
Synonyms:
(S)-2-amino-1-((S)-3-fluoropyrrolidin-1-yl)-4-(3-methyl-1,2,4-oxadiazol-5-yl)butane-1,4-dione | CHEMBL488637
Type:
Small organic molecule
Emp. Form.:
C11H15FN4O3
Mol. Mass.:
270.2602
SMILES:
Cc1noc(n1)C(=O)C[C@H](N)C(=O)N1CC[C@H](F)C1
: