Target
Dipeptidyl peptidase 8
Ligand
BDBM50243864
Substrate
Meas. Tech.
ChEMBL_555162 (CHEMBL965323)
IC50
27000±n/a nM
Citation
 Liang, GBQian, XBiftu, TSingh, SGao, YDScapin, GPatel, SLeiting, BPatel, RWu, JZhang, XThornberry, NAWeber, AE Discovery of new binding elements in DPP-4 inhibition and their applications in novel DPP-4 inhibitor design. Bioorg Med Chem Lett 18:3706-10 (2008)  
Target
Name:
Dipeptidyl peptidase 8
Synonyms:
DPP8 DPRP-1 Dipeptidyl peptidase 8 (DPP-8) Dipeptidyl peptidase 8/9 Dipeptidyl peptidase VIII Prolyl dipeptidase DPP8
Type:
Enzyme
Mol. Mass.:
103342.62
Organism:
Homo sapiens (Human)
Description:
Q6V1X1
Residue:
898
  
Inhibitor
Name:
BDBM50243864
Synonyms:
(R)-3-amino-4-(2,5-difluorophenyl)-1-((S)-2-(hydroxymethyl)pyrrolidin-1-yl)butan-1-one | CHEMBL488484
Type:
Small organic molecule
Emp. Form.:
C15H20F2N2O2
Mol. Mass.:
298.3283
SMILES:
N[C@@H](CC(=O)N1CCC[C@H]1CO)Cc1cc(F)ccc1F
: