Target
Gamma-aminobutyric acid type B receptor subunit 1
Ligand
BDBM50243872
Substrate
Meas. Tech.
ChEMBL_554602 (CHEMBL964516)
EC50
51000±n/a nM
Citation
 Kumar, RJChebib, MHibbs, DEKim, HLJohnston, GASalam, NKHanrahan, JR Novel gamma-aminobutyric acid rho1 receptor antagonists; synthesis, pharmacological activity and structure-activity relationships. J Med Chem 51:3825-40 (2008)  
Target
Name:
Gamma-aminobutyric acid type B receptor subunit 1
Synonyms:
GABA-B receptor GABA-B-R1 GABBR1 GARABR1 Gb1
Type:
Enzyme Catalytic Domain
Mol. Mass.:
108337.22
Organism:
Homo sapiens (Human)
Description:
Q9UBS5
Residue:
961
  
Inhibitor
Name:
BDBM50243872
Synonyms:
(+/-)-4-Amino-1-cyclopent-1-enyl(methyl)phosphinic acid | CHEMBL504482
Type:
Small organic molecule
Emp. Form.:
C6H12NO2P
Mol. Mass.:
161.1387
SMILES:
CP(O)(=O)C1=CCC(N)C1
: