Target
5-hydroxytryptamine receptor 2A
Ligand
BDBM50185474
Substrate
Meas. Tech.
ChEMBL_490813 (CHEMBL992750)
Ki
241.5±n/a nM
Citation
 Ablordeppey, SYAltundas, RBricker, BZhu, XYKumar, EVJackson, TKhan, ARoth, BL Identification of a butyrophenone analog as a potential atypical antipsychotic agent: 4-[4-(4-chlorophenyl)-1,4-diazepan-1-yl]-1-(4-fluorophenyl)butan-1-one. Bioorg Med Chem 16:7291-301 (2008)  
Target
Name:
5-hydroxytryptamine receptor 2A
Synonyms:
5-HT-2 5-HT2A 5-hydroxytryptamine receptor 2A (5HT-2A) 5HT2A_HUMAN HTR2A | Serotonin receptor 2A
Type:
undefined
Mol. Mass.:
52607.65
Organism:
Homo sapiens (Human)
Description:
P28223
Residue:
471
  
Inhibitor
Name:
BDBM50185474
Synonyms:
(+)-4-(3-(4-chlorophenyl)-3-hydroxypyrrolidin-1-yl)-1-(4-fluorophenyl)butan-1-one (-)-4-(3-(4-chlorophenyl)-3-hydroxypyrrolidin-1-yl)-1-(4-fluorophenyl)butan-1-one 4-(3-(4-chlorophenyl)-3-hydroxypyrrolidin-1-yl)-1-(4-fluorophenyl)butan-1-one 4-{3-(4-chlorophenyl)-3-hydroxypyrrolidin-1-yl}-1-(4-fluorophenyl)butan-1-one | CHEMBL150161
Type:
Small organic molecule
Emp. Form.:
C20H21ClFNO2
Mol. Mass.:
361.838
SMILES:
OC1(CCN(CCCC(=O)c2ccc(F)cc2)C1)c1ccc(Cl)cc1
: