Target
Trace amine-associated receptor 1
Ligand
BDBM50236898
Substrate
Meas. Tech.
ChEMBL_489239 (CHEMBL989986)
EC50
1510±n/a nM
Citation
 Lewin, AHNavarro, HAMascarella, SW Structure-activity correlations for beta-phenethylamines at human trace amine receptor 1. Bioorg Med Chem 16:7415-23 (2008)  
Target
Name:
Trace amine-associated receptor 1
Synonyms:
TA1 TAAR1_HUMAN TRAR1 | trace amine-associated receptor 1
Type:
PROTEIN
Mol. Mass.:
39107.47
Organism:
Homo sapiens (Human)
Description:
ChEMBL_792734
Residue:
339
  
Inhibitor
Name:
BDBM50236898
Synonyms:
(1S,2R)-(+)-2-phenylcyclopropylamine TRANYLCYPROMINE trans-2-phenylcyclopropanamine | trans-2-phenylcyclopropylamine
Type:
Small organic molecule
Emp. Form.:
C9H11N
Mol. Mass.:
133.1903
SMILES:
N[C@H]1C[C@@H]1c1ccccc1
: