Target
Interstitial collagenase
Ligand
BDBM50272521
Substrate
Meas. Tech.
ChEMBL_510614 (CHEMBL1002261)
EC50
3.4±n/a nM
Citation
 Ali, ABalkovec, JMGreenlee, MHammond, MLRouen, GTaylor, GEinstein, MGe, LHarris, GKelly, TMMazur, PPandit, SSantoro, JSitlani, AWang, CWilliamson, JForrest, MJCarballo-Jane, ELuell, SLowitz, KVisco, D Discovery of betamethasone 17alpha-carbamates as dissociated glucocorticoid receptor modulators in the rat. Bioorg Med Chem 16:7535-42 (2008)  
Target
Name:
Interstitial collagenase
Synonyms:
CLG MMP1 Matrix metalloproteinase-1 | Matrix metalloproteinase-1 (MMP-1)
Type:
Enzyme
Mol. Mass.:
54010.26
Organism:
Homo sapiens (Human)
Description:
P03956
Residue:
469
  
Inhibitor
Name:
BDBM50272521
Synonyms:
Adamantan-1-yl-carbamic acid (8S,9R,10S,11S,13S,14S,16S,17R)-9-fluoro-11-hydroxy-17-(2-hydroxy-acetyl)-10,13,16-trimethyl-3-oxo-6,7,8,9,10,11,12,13,14,15,16,17-dodecahydro-3H-cyclopenta[a]phenanthren-17-yl este | CHEMBL503041
Type:
Small organic molecule
Emp. Form.:
C33H44FNO6
Mol. Mass.:
569.704
SMILES:
C[C@H]1C[C@H]2[C@@H]3CCC4=CC(=O)C=C[C@]4(C)[C@@]3(F)[C@@H](O)C[C@]2(C)[C@@]1(OC(=O)NC12CC3CC(CC(C3)C1)C2)C(=O)CO
: