Target
Sodium- and chloride-dependent glycine transporter 2
Ligand
BDBM50264862
Substrate
Meas. Tech.
ChEMBL_496466 (CHEMBL1007113)
EC50
4000±n/a nM
Citation
 Pinard, EAlberati, DBorroni, EFischer, HHainzl, DJolidon, SMoreau, JLNarquizian, RNettekoven, MNorcross, RDStalder, HThomas, AW Discovery of benzoylpiperazines as a novel class of potent and selective GlyT1 inhibitors. Bioorg Med Chem Lett 18:5134-9 (2008)  
Target
Name:
Sodium- and chloride-dependent glycine transporter 2
Synonyms:
GLYT2 NET1 SLC6A5 | Sodium- and chloride-dependent glycine transporter 2
Type:
Enzyme Catalytic Domain
Mol. Mass.:
87438.56
Organism:
Homo sapiens (Human)
Description:
Glycine-2-transporter 0 HUMAN::Q9Y345
Residue:
797
  
Inhibitor
Name:
BDBM50264862
Synonyms:
(2-morpholino-5-nitrophenyl)(4-m-tolylpiperazin-1-yl)methanone | CHEMBL484681
Type:
Small organic molecule
Emp. Form.:
C22H26N4O4
Mol. Mass.:
410.4662
SMILES:
Cc1cccc(c1)N1CCN(CC1)C(=O)c1cc(ccc1N1CCOCC1)[N+]([O-])=O
: