Target
Sodium- and chloride-dependent glycine transporter 2
Ligand
BDBM50265272
Substrate
Meas. Tech.
ChEMBL_496466 (CHEMBL1007113)
EC50
1400±n/a nM
Citation
 Pinard, EAlberati, DBorroni, EFischer, HHainzl, DJolidon, SMoreau, JLNarquizian, RNettekoven, MNorcross, RDStalder, HThomas, AW Discovery of benzoylpiperazines as a novel class of potent and selective GlyT1 inhibitors. Bioorg Med Chem Lett 18:5134-9 (2008)  
Target
Name:
Sodium- and chloride-dependent glycine transporter 2
Synonyms:
GLYT2 NET1 SLC6A5 | Sodium- and chloride-dependent glycine transporter 2
Type:
Enzyme Catalytic Domain
Mol. Mass.:
87438.56
Organism:
Homo sapiens (Human)
Description:
Glycine-2-transporter 0 HUMAN::Q9Y345
Residue:
797
  
Inhibitor
Name:
BDBM50265272
Synonyms:
1-(3-fluoro-4-(4-(2-(methylamino)-5-nitrobenzoyl)piperazin-1-yl)phenyl)ethanone | CHEMBL522390
Type:
Small organic molecule
Emp. Form.:
C20H21FN4O4
Mol. Mass.:
400.4035
SMILES:
CNc1ccc(cc1C(=O)N1CCN(CC1)c1ccc(cc1F)C(C)=O)[N+]([O-])=O
: