Target
Melanocortin receptor 4
Ligand
BDBM50253734
Substrate
Meas. Tech.
ChEMBL_538611 (CHEMBL1027401)
EC50
8±n/a nM
Citation
 Tian, XSwitzer, AGDerose, SAMishra, RKSolinsky, MGMumin, RNEbetino, FHJayasinghe, LRWebster, MEColson, AOCrossdoersen, DPinney, BBFarmer, JADowty, MEObringer, CMCruze, CABurklow, MLSuchanek, PMDong, LDirr, MKSheldon, RJWos, JA Discovery of orally bioavailable 1,3,4-trisubstituted 2-oxopiperazine-based melanocortin-4 receptor agonists as potential antiobesity agents. J Med Chem 51:6055-66 (2008)  
Target
Name:
Melanocortin receptor 4
Synonyms:
MC4-R MC4R_HUMAN Melanocortin receptor 4 (MC-4) Melanocortin receptor 4 (MC4R)
Type:
Enzyme
Mol. Mass.:
36949.50
Organism:
Homo sapiens (Human)
Description:
P32245
Residue:
332
  
Inhibitor
Name:
BDBM50253734
Synonyms:
CHEMBL507876 | N-((1R)-1-[(4-Fluorophenyl)methyl]-2-{(2S)-4-[(1S)-2-(methylamino)-1-(2-naphthalenylmethyl)-2-oxoethyl]-3-oxo-2-propyl-1-piperazinyl}-2-oxoethyl)-2,2-dimethylpropanamide
Type:
Small organic molecule
Emp. Form.:
C35H43FN4O4
Mol. Mass.:
602.7387
SMILES:
CCC[C@@H]1N(CCN([C@@H](Cc2ccc3ccccc3c2)C(=O)NC)C1=O)C(=O)[C@@H](Cc1ccc(F)cc1)NC(=O)C(C)(C)C
: