Target
D(3) dopamine receptor
Ligand
BDBM50253619
Substrate
Meas. Tech.
ChEMBL_538668 (CHEMBL1033066)
IC50
0.85±n/a nM
Citation
 Paul, NMTaylor, MKumar, RDeschamps, JRLuedtke, RRNewman, AH Structure-activity relationships for a novel series of dopamine D2-like receptor ligands based on N-substituted 3-aryl-8-azabicyclo[3.2.1]octan-3-ol. J Med Chem 51:6095-109 (2008)  
Target
Name:
D(3) dopamine receptor
Synonyms:
DOPAMINE D3 DRD3_HUMAN Dopamine D3 receptor (D3) Dopamine receptor Dopamine receptor D3
Type:
Mol. Mass.:
44243.43
Organism:
Homo sapiens (Human)
Description:
Residue:
400
  
Inhibitor
Name:
BDBM50253619
Synonyms:
CHEMBL493278 | endo-8-(Benzofur-3-ylmethyl)-3-(4-chlorophenyl)-8-azabicyclo[3.2.1]octan-3-ol
Type:
Small organic molecule
Emp. Form.:
C22H22ClNO2
Mol. Mass.:
367.869
SMILES:
OC1(CC2CCC(C1)N2Cc1coc2ccccc12)c1ccc(Cl)cc1
: