Target
Matrix metalloproteinase-15
Ligand
BDBM26526
Substrate
Meas. Tech.
ChEMBL_497444 (CHEMBL1005438)
Ki
3997±n/a nM
Citation
 Georgiadis, DYiotakis, A Specific targeting of metzincin family members with small-molecule inhibitors: progress toward a multifarious challenge. Bioorg Med Chem 16:8781-94 (2008)  
Target
Name:
Matrix metalloproteinase-15
Synonyms:
MMP-15 MMP15_HUMAN MT2-MMP MTMMP2 Matrix metalloproteinase-15 Membrane-type-2 matrix metalloproteinase | SMCP-2
Type:
PROTEIN
Mol. Mass.:
75814.08
Organism:
Homo sapiens (Human)
Description:
ChEMBL_106793
Residue:
669
  
Inhibitor
Name:
BDBM26526
Synonyms:
(2R)-N-hydroxy-2-[(3S)-3-methyl-3-{4-[(2-methylquinolin-4-yl)methoxy]phenyl}-2-oxopyrrolidin-1-yl]propanamide CHEMBL148169 | IK682
Type:
Small organic molecule
Emp. Form.:
C25H27N3O4
Mol. Mass.:
433.4996
SMILES:
C[C@@H](N1CC[C@](C)(C1=O)c1ccc(OCc2cc(C)nc3ccccc23)cc1)C(=O)NO
: